Target
L-selectin
Ligand
BDBM50205395
Substrate
Meas. Tech.
ChEMBL_428319 (CHEMBL917097)
IC50
13600±n/a nM
Citation
 Kranich, RBusemann, ASBock, DSchroeter-Maas, SBeyer, DHeinemann, BMeyer, MSchierhorn, KZahlten, RWolff, GAydt, EM Rational design of novel, potent small molecule pan-selectin antagonists. J Med Chem 50:1101-15 (2007)  
Target
Name:
L-selectin
Synonyms:
LNHR LYAM1_HUMAN SELL | Selectin
Type:
PROTEIN
Mol. Mass.:
42187.20
Organism:
Homo sapiens (Human)
Description:
ChEMBL_200000
Residue:
372
  
Inhibitor
Name:
BDBM50205395
Synonyms:
(5-{2-[3-(3,4,5-trihydroxy-phenyl)-propionylamino]-phenyl}-thiophen-2-yl)-acetic acid | CHEMBL220565
Type:
Small organic molecule
Emp. Form.:
C21H19NO6S
Mol. Mass.:
413.444
SMILES:
OC(=O)Cc1ccc(s1)-c1ccccc1NC(=O)CCc1cc(O)c(O)c(O)c1
: