Target
RmtA
Ligand
BDBM50206442
Substrate
Meas. Tech.
ChEMBL_428528 (CHEMBL919885)
IC50
160000±n/a nM
Citation
 Ragno, RSimeoni, SCastellano, SVicidomini, CMai, ACaroli, ATramontano, ABonaccini, CTrojer, PBauer, IBrosch, GSbardella, G Small molecule inhibitors of histone arginine methyltransferases: homology modeling, molecular docking, binding mode analysis, and biological evaluations. J Med Chem 50:1241-53 (2007)  
Target
Name:
RmtA
Synonyms:
Type:
PROTEIN
Mol. Mass.:
39351.26
Organism:
Emericella nidulans
Description:
ChEMBL_475539
Residue:
345
  
Inhibitor
Name:
BDBM50206442
Synonyms:
2,6,7-trihydroxy-9-phenyl-3H-xanthen-3-one cid_70420
Type:
Small organic molecule
Emp. Form.:
C19H12O5
Mol. Mass.:
320.2956
SMILES:
Oc1cc2oc3cc(=O)c(O)cc3c(-c3ccccc3)c2cc1O
: