Target
Enoyl-acyl-carrier protein reductase
Ligand
BDBM50211908
Substrate
Meas. Tech.
ChEMBL_436469 (CHEMBL904776)
Ki
880±n/a nM
Citation
 Kumar, GParasuraman, PSharma, SKBanerjee, TKarmodiya, KSurolia, NSurolia, A Discovery of a rhodanine class of compounds as inhibitors of Plasmodium falciparum enoyl-acyl carrier protein reductase. J Med Chem 50:2665-75 (2007)  
Target
Name:
Enoyl-acyl-carrier protein reductase
Synonyms:
Type:
PROTEIN
Mol. Mass.:
49770.86
Organism:
Plasmodium falciparum
Description:
ChEMBL_795989
Residue:
432
  
Inhibitor
Name:
BDBM50211908
Synonyms:
5-((5-(3-chlorophenyl)furan-2-yl)methylene)-2-thioxothiazolidin-4-one | CHEMBL227619
Type:
Small organic molecule
Emp. Form.:
C14H8ClNO2S2
Mol. Mass.:
321.802
SMILES:
SC1=NC(=O)C(S1)=Cc1ccc(o1)-c1cccc(Cl)c1
: