Target
Aromatase
Ligand
BDBM50213243
Substrate
Meas. Tech.
ChEMBL_436856 (CHEMBL905158)
IC50
25140±n/a nM
Citation
 Maiti, ACuendet, MCroy, VLEndringer, DCPezzuto, JMCushman, M Synthesis and biological evaluation of (+/-)-abyssinone II and its analogues as aromatase inhibitors for chemoprevention of breast cancer. J Med Chem 50:2799-806 (2007)  
Target
Name:
Aromatase
Synonyms:
ARO1 CP19A_HUMAN CYP19 CYPXIX Cytochrome P450 19A1 Cytochrome P450-C19 (CYP19) FL cytokine receptor precursor | P-450AROM
Type:
Enzyme
Mol. Mass.:
57888.92
Organism:
Homo sapiens (Human)
Description:
P11511
Residue:
503
  
Inhibitor
Name:
BDBM50213243
Synonyms:
7-methoxy-2-[4-(methoxymethoxy)-3-(3-methylbut-2-enyl)-phenyl]chroman-4-one | CHEMBL229790
Type:
Small organic molecule
Emp. Form.:
C23H26O5
Mol. Mass.:
382.4495
SMILES:
[#6]-[#8]-[#6]-[#8]-c1ccc(cc1-[#6]\[#6]=[#6](\[#6])-[#6])-[#6]-1-[#6]-[#6](=O)-c2ccc(-[#8]-[#6])cc2-[#8]-1
: