Target
Acyl-CoA desaturase 1
Ligand
BDBM50371080
Substrate
Meas. Tech.
ChEMBL_438936 (CHEMBL889279)
IC50
1±n/a nM
Citation
 Liu, GLynch, JKFreeman, JLiu, BXin, ZZhao, HSerby, MDKym, PRSuhar, TSSmith, HTCao, NYang, RJanis, RSKrauser, JACepa, SPBeno, DWSham, HLCollins, CASurowy, TKCamp, HS Discovery of potent, selective, orally bioavailable stearoyl-CoA desaturase 1 inhibitors. J Med Chem 50:3086-100 (2007)  
Target
Name:
Acyl-CoA desaturase 1
Synonyms:
ACOD1_MOUSE | Scd1
Type:
PROTEIN
Mol. Mass.:
41064.54
Organism:
Mus musculus
Description:
ChEMBL_1462109
Residue:
355
  
Inhibitor
Name:
BDBM50371080
Synonyms:
CHEMBL376392
Type:
Small organic molecule
Emp. Form.:
C16H16ClFN4O2
Mol. Mass.:
350.775
SMILES:
NC(=O)c1ccc(nn1)N1CCC(CC1)Oc1cc(F)ccc1Cl
: