Target
Transient receptor potential cation channel subfamily V member 1
Ligand
BDBM20461
Substrate
Meas. Tech.
ChEMBL_440725 (CHEMBL889822)
EC50
40±n/a nM
Citation
 Appendino, GEch-Chahad, AMinassi, ABacchiega, SDe Petrocellis, LDi Marzo, V Structure-activity relationships of the ultrapotent vanilloid resiniferatoxin (RTX): the homovanillyl moiety. Bioorg Med Chem Lett 17:132-5 (2006)  
Target
Name:
Transient receptor potential cation channel subfamily V member 1
Synonyms:
Capsaicin receptor Osm-9-like TRP channel 1 TRPV1_HUMAN Transient receptor potential cation channel subfamily V member 1 (TRPV1) Transient receptor potential cation channel subfamily V member 1(TRPV1) Vanilloid VR1 Vanilloid receptor 1 Vanilloid receptor 1 (VRI/TRPV1)
Type:
Protein
Mol. Mass.:
94960.75
Organism:
Homo sapiens (Human)
Description:
Q8NER1
Residue:
839
  
Inhibitor
Name:
BDBM20461
Synonyms:
(6E)-N-[(4-hydroxy-3-methoxyphenyl)methyl]-8-methylnon-6-enamide CAP Capsaicin | Zostrix
Type:
Emp. Form.:
C18H27NO3
Mol. Mass.:
305.4119
SMILES:
COc1cc(CNC(=O)CCCC\C=C\C(C)C)ccc1O
: