Target
Beta-lactamase
Ligand
BDBM50021959
Substrate
Meas. Tech.
ChEMBL_445226 (CHEMBL894370)
IC50
136200±n/a nM
Citation
 Plantan, ISelic, LMesar, TAnderluh, PSOblak, MPrezelj, AHesse, LAndrejasic, MVilar, MTurk, DKocijan, APrevec, TVilfan, GKocjan, DCopar, AUrleb, USolmajer, T 4-Substituted trinems as broad spectrum beta-lactamase inhibitors: structure-based design, synthesis, and biological activity. J Med Chem 50:4113-21 (2007)  
Target
Name:
Beta-lactamase
Synonyms:
AMPC_ENTCL | ampC
Type:
PROTEIN
Mol. Mass.:
41306.67
Organism:
Enterobacter cloacae
Description:
ChEMBL_40258
Residue:
381
  
Inhibitor
Name:
BDBM50021959
Synonyms:
CHEMBL777 US9120808, Clavulanic acid potassium salt clavulanic acid
Type:
Small organic molecule
Emp. Form.:
C8H9NO5
Mol. Mass.:
199.1608
SMILES:
OC\C=C1/O[C@@H]2CC(=O)N2[C@H]1C(O)=O
: