Target
Adenosine receptor A1
Ligand
BDBM50225878
Substrate
Meas. Tech.
ChEMBL_451676 (CHEMBL901889)
IC50
3.2±n/a nM
Citation
 Ashton, TDAumann, KMBaker, SPSchiesser, CHScammells, PJ Structure-activity relationships of adenosines with heterocyclic N6-substituents. Bioorg Med Chem Lett 17:6779-84 (2007)  
Target
Name:
Adenosine receptor A1
Synonyms:
A1 adenosine receptor (hA1) AA1R_HUMAN ADORA1 Adenosine A1-receptor Adenosine receptor A1 (hA1) | Adenosine transporter (AdT)
Type:
G Protein-Coupled Receptor (GPCR)
Mol. Mass.:
36520.92
Organism:
Homo sapiens (Human)
Description:
P30542
Residue:
326
  
Inhibitor
Name:
BDBM50225878
Synonyms:
(R)-benzyl 3-(9-((2R,3R,4S,5R)-3,4-dihydroxy-5-(hydroxymethyl)-tetrahydrofuran-2-yl)-9H-purin-6-ylamino)pyrrolidine-1-carboxylate | CHEMBL240278
Type:
Small organic molecule
Emp. Form.:
C22H26N6O6
Mol. Mass.:
470.4784
SMILES:
OC[C@H]1O[C@H]([C@H](O)[C@@H]1O)n1cnc2c(N[C@@H]3CCN(C3)C(=O)OCc3ccccc3)ncnc12
: