Target
25-hydroxyvitamin D-1 alpha hydroxylase, mitochondrial
Ligand
BDBM50214606
Substrate
Meas. Tech.
ChEMBL_459091 (CHEMBL926259)
IC50
616±n/a nM
Citation
 Bruno, RDNjar, VC Targeting cytochrome P450 enzymes: a new approach in anti-cancer drug development. Bioorg Med Chem 15:5047-60 (2007)  
Target
Name:
25-hydroxyvitamin D-1 alpha hydroxylase, mitochondrial
Synonyms:
25-hydroxyvitamin D-1 alpha hydroxylase, mitochondrial CYP1ALPHA CYP27B1 | Cytochrome P450 27B1
Type:
Protein
Mol. Mass.:
56522.50
Organism:
Homo sapiens (Human)
Description:
O15528
Residue:
508
  
Inhibitor
Name:
BDBM50214606
Synonyms:
4'-chloro-biphenyl-4-carboxylic acid (2-imidazol-1-yl-2-phenyl-ethyl)-amide CHEMBL253613
Type:
Small organic molecule
Emp. Form.:
C24H20ClN3O
Mol. Mass.:
401.888
SMILES:
Clc1ccc(cc1)-c1ccc(cc1)C(=O)NCC(c1ccccc1)n1ccnc1
: