Target
Xaa-Pro dipeptidase
Ligand
BDBM50232502
Substrate
Meas. Tech.
ChEMBL_461055 (CHEMBL944087)
IC50
>10000±n/a nM
Citation
 Kim, DKowalchick, JEBrockunier, LLParmee, EREiermann, GJFisher, MHHe, HLeiting, BLyons, KScapin, GPatel, SBPetrov, APryor, KDRoy, RSWu, JKZhang, XWyvratt, MJZhang, BBZhu, LThornberry, NAWeber, AE Discovery of potent and selective dipeptidyl peptidase IV inhibitors derived from beta-aminoamides bearing subsituted triazolopiperazines. J Med Chem 51:589-602 (2008)  
Target
Name:
Xaa-Pro dipeptidase
Synonyms:
PEPD PRD
Type:
PROTEIN
Mol. Mass.:
54541.05
Organism:
Homo sapiens (Human)
Description:
ChEMBL_159887
Residue:
493
  
Inhibitor
Name:
BDBM50232502
Synonyms:
(2R)-4-[(8S)-8-methyl-3-(trifluoromethyl)-5,6-dihydro[[1,-2,4]triazolo[4,3-a]pyrazin-7(8H)-yl]-4-oxo-1-(2,4,5-trifluorophenyl)butan-2-amine hydrochloride | CHEMBL557542
Type:
Small organic molecule
Emp. Form.:
C17H17F6N5O
Mol. Mass.:
421.3402
SMILES:
C[C@@H]1N(CCn2c1nnc2C(F)(F)F)C(=O)C[C@H](N)Cc1cc(F)c(F)cc1F
: