Target
Xaa-Pro dipeptidase
Ligand
BDBM50232508
Substrate
Meas. Tech.
ChEMBL_461055 (CHEMBL944087)
IC50
>10000±n/a nM
Citation
 Kim, DKowalchick, JEBrockunier, LLParmee, EREiermann, GJFisher, MHHe, HLeiting, BLyons, KScapin, GPatel, SBPetrov, APryor, KDRoy, RSWu, JKZhang, XWyvratt, MJZhang, BBZhu, LThornberry, NAWeber, AE Discovery of potent and selective dipeptidyl peptidase IV inhibitors derived from beta-aminoamides bearing subsituted triazolopiperazines. J Med Chem 51:589-602 (2008)  
Target
Name:
Xaa-Pro dipeptidase
Synonyms:
PEPD PRD
Type:
PROTEIN
Mol. Mass.:
54541.05
Organism:
Homo sapiens (Human)
Description:
ChEMBL_159887
Residue:
493
  
Inhibitor
Name:
BDBM50232508
Synonyms:
(2R)-4-[8-(2,2,2-trifluoroethyl)-3-(trifluoromethyl)-5,6-dihydro[[1,2,4]triazolo[4,3-a]pyrazin-7(8H)-yl]-4-oxo-1-(2,4,5-trifluorophenyl)butan-2-amine hydrochloride | CHEMBL536999
Type:
Small organic molecule
Emp. Form.:
C18H16F9N5O
Mol. Mass.:
489.3382
SMILES:
N[C@@H](CC(=O)N1CCn2c(nnc2C(F)(F)F)C1CC(F)(F)F)Cc1cc(F)c(F)cc1F
: