Target
Disintegrin and metalloproteinase domain-containing protein 17
Ligand
BDBM50229322
Substrate
Meas. Tech.
ChEMBL_463233 (CHEMBL930623)
IC50
0.14±n/a nM
Citation
 Ott, GRAsakawa, NLu, ZLiu, RQCovington, MBVaddi, KQian, MNewton, RCChrist, DDTraskos, JMDecicco, CPDuan, JJ Alpha,beta-cyclic-beta-benzamido hydroxamic acids: novel templates for the design, synthesis, and evaluation of selective inhibitors of TNF-alpha converting enzyme (TACE). Bioorg Med Chem Lett 18:694-9 (2008)  
Target
Name:
Disintegrin and metalloproteinase domain-containing protein 17
Synonyms:
A disintegrin and metalloproteinase domain 17 ADAM 17 Snake venom-like protease TNF-alpha-Converting Enzyme
Type:
Metalloprotease
Mol. Mass.:
12197.99
Organism:
Sus scrofa (pig)
Description:
Partially purified TACE was obtained from porcine spleen.
Residue:
112
  
Inhibitor
Name:
BDBM50229322
Synonyms:
(3S,4S)-N-hydroxy-4-(4-((2-methylquinolin-4-yl)methoxy)benzamido)-1-(prop-2-ynyl)pyrrolidine-3-carboxamide | CHEMBL271235
Type:
Small organic molecule
Emp. Form.:
C26H26N4O4
Mol. Mass.:
458.509
SMILES:
Cc1cc(COc2ccc(cc2)C(=O)N[C@@H]2CN(CC#C)C[C@@H]2C(=O)NO)c2ccccc2n1
: