Target
Liver carboxylesterase 1
Ligand
BDBM50204493
Substrate
Meas. Tech.
ChEMBL_464891 (CHEMBL949090)
IC50
20±n/a nM
Citation
 Kimball, FSRomero, FAEzzili, CGarfunkle, JRayl, TJHochstatter, DGHwang, IBoger, DL Optimization of alpha-ketooxazole inhibitors of fatty acid amide hydrolase. J Med Chem 51:937-47 (2008)  
Target
Name:
Liver carboxylesterase 1
Synonyms:
Acyl coenzyme A:cholesterol acyltransferase CES1 EST1_HUMAN Serine hydrolase (CES1)
Type:
Protein
Mol. Mass.:
62520.83
Organism:
Homo sapiens (Human)
Description:
Residue:
567
  
Inhibitor
Name:
BDBM50204493
Synonyms:
1-(oxazol-2-yl)-7-phenylheptan-1-one | CHEMBL220125
Type:
Small organic molecule
Emp. Form.:
C16H19NO2
Mol. Mass.:
257.3276
SMILES:
O=C(CCCCCCc1ccccc1)c1ncco1
: