Target
cGMP-inhibited 3',5'-cyclic phosphodiesterase 3A
Ligand
BDBM14750
Substrate
Meas. Tech.
ChEMBL_466943 (CHEMBL933708)
Ki
271±n/a nM
Citation
 Kulkarni, SSPatel, MRTalele, TT CoMFA and HQSAR studies on 6,7-dimethoxy-4-pyrrolidylquinazoline derivatives as phosphodiesterase10A inhibitors. Bioorg Med Chem 16:3675-86 (2008)  
Target
Name:
cGMP-inhibited 3',5'-cyclic phosphodiesterase 3A
Synonyms:
3',5'-cyclic phosphodiesterase Cyclic GMP-inhibited phosphodiesterase A PDE3A_HUMAN Phosphodiesterase 3 (PDE3) Phosphodiesterase 3A Phosphodiesterase 3A (PDE3A1) cGMP-inhibited 3',5'-cyclic phosphodiesterase A | cGMP-inhibited 3,5-cyclic phosphodiesterase A
Type:
Enzyme
Mol. Mass.:
124966.46
Organism:
Homo sapiens (Human)
Description:
Q14432
Residue:
1141
  
Inhibitor
Name:
BDBM14750
Synonyms:
(R)-4-[3-(Biphenyl-3-yloxy)-pyrrolidin-1-yl]-6,7-dimethoxy-quinazoline 6,7-dimethoxy-4-[(3R)-3-(3-phenylphenoxy)pyrrolidin-1-yl]quinazoline
Type:
Small organic molecule
Emp. Form.:
C26H25N3O3
Mol. Mass.:
427.495
SMILES:
COc1cc2ncnc(N3CC[C@H](C3)Oc3cccc(c3)-c3ccccc3)c2cc1OC
: