Target
Transketolase
Ligand
BDBM50373886
Substrate
Meas. Tech.
ChEMBL_468614 (CHEMBL947911)
Kd
18000±n/a nM
Citation
 Thomas, AADe Meese, JLe Huerou, YBoyd, SARomoff, TTGonzales, SSGunawardana, IKaplan, TSullivan, FCondroski, KLyssikatos, JPAicher, TDBallard, JBernat, BDeWolf, WHan, MLemieux, CSmith, DWeiler, SWright, SKVigers, GBrandhuber, B Non-charged thiamine analogs as inhibitors of enzyme transketolase. Bioorg Med Chem Lett 18:509-12 (2008)  
Target
Name:
Transketolase
Synonyms:
TK TKT_HUMAN
Type:
PROTEIN
Mol. Mass.:
67886.43
Organism:
Homo sapiens (Human)
Description:
ChEMBL_468615
Residue:
623
  
Inhibitor
Name:
BDBM50373886
Synonyms:
3-Deazathiamine | CHEMBL401772
Type:
Small organic molecule
Emp. Form.:
C13H17N3OS
Mol. Mass.:
263.359
SMILES:
Cc1c(Cc2cnc(C)nc2N)csc1CCO
: