Target
Coagulation factor X
Ligand
BDBM50374877
Substrate
Meas. Tech.
ChEMBL_470061 (CHEMBL933439)
Ki
0.013±n/a nM
Citation
 Smallheer, JMWang, SLaws, MLNakajima, SHu, ZHan, WJacobson, ILuettgen, JMRossi, KARendina, ARKnabb, RMWexler, RRLam, PYQuan, ML Sulfonamidolactam inhibitors of coagulation factor Xa. Bioorg Med Chem Lett 18:2428-33 (2008)  
Target
Name:
Coagulation factor X
Synonyms:
Activated coagulation factor X (FXa) Coagulation factor X precursor F10 Factor X heavy chain Factor Xa Stuart-Prower factor
Type:
Enzyme
Mol. Mass.:
54726.60
Organism:
Homo sapiens (Human)
Description:
Residue:
488
  
Inhibitor
Name:
BDBM50374877
Synonyms:
CHEMBL270221
Type:
Small organic molecule
Emp. Form.:
C30H32ClFN6O5S2
Mol. Mass.:
675.194
SMILES:
CN(C)CCN(C)C(=O)CN(C1CCCN(C1=O)c1ccc(cc1F)-n1ccccc1=O)S(=O)(=O)c1cc2ccc(Cl)nc2s1
: