Target
Calcium/calmodulin-dependent protein kinase type II subunit delta
Ligand
BDBM2691
Substrate
Meas. Tech.
ChEMBL_470254 (CHEMBL950209)
IC50
380±n/a nM
Citation
 Lu, QChen, ZPerumattam, JWang, DXLiang, WXu, YJDo, SBonaga, LHigaki, JDong, HLiclican, ASideris, SLaney, MDugar, SMavunkel, BLevy, DE Aryl-indolyl maleimides as inhibitors of CaMKIIdelta. Part 3: Importance of the indole orientation. Bioorg Med Chem Lett 18:2399-403 (2008)  
Target
Name:
Calcium/calmodulin-dependent protein kinase type II subunit delta
Synonyms:
CAMK2D CaM kinase II CaMK-II subunit delta Calcium/calmodulin-dependent protein kinase type II subunit delta (CAMK2D) KCC2D_HUMAN
Type:
Enzyme Catalytic Domain
Mol. Mass.:
56419.78
Organism:
Homo sapiens (Human)
Description:
Q13557
Residue:
499
  
Inhibitor
Name:
BDBM2691
Synonyms:
3-[1-(3-aminopropyl)-1H-indol-3-yl]-4-(1H-indol-3-yl)-2,5-dihydro-1H-pyrrole-2,5-dione Bisindolyl deriv. 19
Type:
Small organic molecule
Emp. Form.:
C23H20N4O2
Mol. Mass.:
384.4305
SMILES:
NCCCn1cc(C2=C(C(=O)NC2=O)c2c[nH]c3ccccc23)c2ccccc12
: