Target
Progesterone receptor
Ligand
BDBM50375424
Substrate
Meas. Tech.
ChEMBL_472015 (CHEMBL940098)
IC50
0.2±n/a nM
Citation
 Rewinkel, JEnthoven, MGolstein, Ivan der Rijst, MScholten, Avan Tilborg, Mde Weys, DWisse, JHamersma, H 11-(pyridinylphenyl)steroids--a new class of mixed-profile progesterone agonists/antagonists. Bioorg Med Chem 16:2753-63 (2008)  
Target
Name:
Progesterone receptor
Synonyms:
NR3C3 PGR PRGR_HUMAN | progesterone
Type:
Protein
Mol. Mass.:
98979.52
Organism:
Homo sapiens (Human)
Description:
P06401
Residue:
933
  
Inhibitor
Name:
BDBM50375424
Synonyms:
ULIPRISTAL ACETATE | Ulipristal
Type:
Small organic molecule
Emp. Form.:
C30H37NO4
Mol. Mass.:
475.6191
SMILES:
CN(C)c1ccc(cc1)[C@H]1C[C@@]2(C)[C@@H](CC[C@]2(OC(C)=O)C(C)=O)[C@@H]2CCC3=CC(=O)CCC3=C12
: