Target
Beta-lactamase
Ligand
BDBM50053173
Substrate
Meas. Tech.
ChEMBL_474299 (CHEMBL936078)
IC50
10±n/a nM
Citation
 Papagiannitsis, CCLoli, ATzouvelekis, LSTzelepi, EArlet, GMiriagou, V SCO-1, a novel plasmid-mediated class A beta-lactamase with carbenicillinase characteristics from Escherichia coli. Antimicrob Agents Chemother 51:2185-8 (2007)  
Target
Name:
Beta-lactamase
Synonyms:
Beta-lactamase SCO-1 | SCO-1 carbenicillinase
Type:
PROTEIN
Mol. Mass.:
30647.09
Organism:
Escherichia coli
Description:
ChEMBL_474299
Residue:
288
  
Inhibitor
Name:
BDBM50053173
Synonyms:
(2S,3S,5R)-3-Methyl-4,4,7-trioxo-3-[1,2,3]triazol-1-ylmethyl-4-thia-1-aza-bicyclo[3.2.0]heptane-2-carboxylic acid (2S,3S,5R)-3-methyl-4,4,7-trioxo-3-[1,2,3]triazol-1-ylmethyl-4lambda6-thia-1-aza-bicyclo[3.2.0]heptane-2-carboxylic acid 3-Methyl-4,4,7-trioxo-3-[1,2,3]triazol-1-ylmethyl-4lambda*6*-thia-1-aza-bicyclo[3.2.0]heptane-2-carboxylic acid CL-298741 US9120808, Tazobactam sodium salt YTR-830H | Zosyn
Type:
Small organic molecule
Emp. Form.:
C10H12N4O5S
Mol. Mass.:
300.291
SMILES:
C[C@]1(Cn2ccnn2)[C@@H](N2[C@@H](CC2=O)S1(=O)=O)C(O)=O
: