Target
Vascular endothelial growth factor receptor 2
Ligand
BDBM50376039
Substrate
Meas. Tech.
ChEMBL_474871 (CHEMBL932834)
IC50
2±n/a nM
Citation
 Harmange, JCWeiss, MMGermain, JPolverino, AJBorg, GBready, JChen, DChoquette, DCoxon, ADeMelfi, TDiPietro, LDoerr, NEstrada, JFlynn, JGraceffa, RFHarriman, SPKaufman, SLa, DSLong, AMartin, MWNeervannan, SPatel, VFPotashman, MRegal, KRoveto, PMSchrag, MLStarnes, CTasker, ATeffera, YWang, LWhite, RDWhittington, DAZanon, R Naphthamides as novel and potent vascular endothelial growth factor receptor tyrosine kinase inhibitors: design, synthesis, and evaluation. J Med Chem 51:1649-67 (2008)  
Target
Name:
Vascular endothelial growth factor receptor 2
Synonyms:
CD_antigen=CD309 Fetal liver kinase 1 (FLK-1) KDR Protein-tyrosine kinase receptor Flk-1 VEGFR-2 VEGFR2 Vascular Endothelial Growth Factor Receptor Kinase 2 Vascular endothelial growth factor receptor 2 (KDR) Vascular endothelial growth factor receptor 2 (VEGFR2) Vascular endothelial growth factor receptor-2 (VEGFR-2)
Type:
Receptor Tyrosine Kinase
Mol. Mass.:
151510.97
Organism:
Homo sapiens (Human)
Description:
P35968
Residue:
1356
  
Inhibitor
Name:
BDBM50376039
Synonyms:
CHEMBL270547
Type:
Small organic molecule
Emp. Form.:
C28H21FN2O4
Mol. Mass.:
468.4757
SMILES:
COc1cc2nccc(Oc3ccc4c(cccc4c3)C(=O)Nc3ccccc3F)c2cc1OC
: