Target
Epidermal growth factor receptor
Ligand
BDBM36351
Substrate
Meas. Tech.
ChEMBL_477145 (CHEMBL921756)
Kd
0.82±n/a nM
Citation
 Buchholz, SSchally, AVEngel, JBHohla, FHeinrich, EKoester, FVarga, JLHalmos, G Potentiation of mammary cancer inhibition by combination of antagonists of growth hormone-releasing hormone with docetaxel. Proc Natl Acad Sci U S A 104:1943-6 (2007)  
Target
Name:
Epidermal growth factor receptor
Synonyms:
EGF Receptor Substrate EGFR_HUMAN ERBB1 Epidermal Growth Factor Receptor erbB-1 Epidermal growth factor receptor (EGFR) HER1 Proto-oncogene c-ErbB-1 Tyrosine-Protein Kinase ErbB-1
Type:
Receptor Kinase Domain
Mol. Mass.:
134279.59
Organism:
Homo sapiens (Human)
Description:
P00533
Residue:
1210
  
Inhibitor
Name:
BDBM36351
Synonyms:
CID148124 | Docetaxel
Type:
Small organic molecule
Emp. Form.:
C43H53NO14
Mol. Mass.:
807.8792
SMILES:
[H][C@]12[C@H](OC(=O)c3ccccc3)[C@]3(O)C[C@H](OC(=O)[C@H](O)[C@@H](NC(=O)OC(C)(C)C)c4ccccc4)C(C)=C([C@@H](O)C(=O)[C@]1(C)[C@@H](O)C[C@H]1OC[C@@]21OC(C)=O)C3(C)C
: