Target
Androgen receptor
Ligand
BDBM50377414
Substrate
Meas. Tech.
ChEMBL_479690 (CHEMBL933554)
Ki
1.3±n/a nM
Citation
 Long, YOHiguchi, RICaferro, TRLau, TLWu, MCummings, MLMartinborough, EAMarschke, KBChang, WYLópez, FJKaranewsky, DSZhi, L Selective androgen receptor modulators based on a series of 7H-[1,4]oxazino[3,2-g]quinolin-7-ones with improved in vivo activity. Bioorg Med Chem Lett 18:2967-71 (2008)  
Target
Name:
Androgen receptor
Synonyms:
ANDR_HUMAN Androgen Receptor Androgen receptor/Baculoviral IAP repeat-containing protein 2 Dihydrotestosterone receptor Nuclear receptor subfamily 3 group C member 4
Type:
Receptor
Mol. Mass.:
99185.27
Organism:
Homo sapiens (Human)
Description:
CHO cells were stably transfected with human AR gene.
Residue:
920
  
Inhibitor
Name:
BDBM50377414
Synonyms:
CHEMBL402835
Type:
Small organic molecule
Emp. Form.:
C20H14F6N2O2
Mol. Mass.:
428.3278
SMILES:
FC(F)(F)CN1[C@@H](COc2cc3[nH]c(=O)cc(c3cc12)C(F)(F)F)c1ccccc1
: