Target
5-hydroxytryptamine receptor 2A
Ligand
BDBM50271706
Substrate
Meas. Tech.
ChEMBL_556761 (CHEMBL961459)
Kd
0.097000±n/a nM
Citation
 Nichols, DEFrescas, SPChemel, BRRehder, KSZhong, DLewin, AH High specific activity tritium-labeled N-(2-methoxybenzyl)-2,5-dimethoxy-4-iodophenethylamine (INBMeO): a high-affinity 5-HT2A receptor-selective agonist radioligand. Bioorg Med Chem 16:6116-23 (2008)  
Target
Name:
5-hydroxytryptamine receptor 2A
Synonyms:
5-HT-2 5-HT2A 5-hydroxytryptamine receptor 2A (5HT-2A) 5HT2A_HUMAN HTR2A | Serotonin receptor 2A
Type:
undefined
Mol. Mass.:
52607.65
Organism:
Homo sapiens (Human)
Description:
P28223
Residue:
471
  
Inhibitor
Name:
BDBM50271706
Synonyms:
CHEMBL482496 | N-(2-[3H-OCH3]benzyl)-2-(2-[3H-OCH3]-5-methoxy-4-iodophenyl)ethylamine
Type:
Small organic molecule
Emp. Form.:
C18H22INO3
Mol. Mass.:
427.2767
SMILES:
COc1ccccc1CNCCc1cc(OC)c(I)cc1OC
: