Target
Acetylcholinesterase
Ligand
BDBM8965
Substrate
Meas. Tech.
ChEMBL_552457 (CHEMBL1002717)
Ki
0.540±n/a nM
Citation
 Butini, SCampiani, GBorriello, MGemma, SPanico, APersico, MCatalanotti, BRos, SBrindisi, MAgnusdei, MFiorini, INacci, VNovellino, EBelinskaya, TSaxena, AFattorusso, C Exploiting protein fluctuations at the active-site gorge of human cholinesterases: further optimization of the design strategy to develop extremely potent inhibitors. J Med Chem 51:3154-70 (2008)  
Target
Name:
Acetylcholinesterase
Synonyms:
ACES_HUMAN Acetylcholinesterase (AChE) | Acetylcholinesterase (human AChE)
Type:
Enzyme
Mol. Mass.:
67792.70
Organism:
Homo sapiens (Human)
Description:
P22303
Residue:
614
  
Inhibitor
Name:
BDBM8965
Synonyms:
CHEMBL338755 methylbis[3-(1,2,3,4-tetrahydroacridin-9-ylamino)propyl]amine
Type:
Small organic molecule
Emp. Form.:
C33H41N5
Mol. Mass.:
507.7121
SMILES:
CN(CCCNc1c2CCCCc2nc2ccccc12)CCCNc1c2CCCCc2nc2ccccc12
: