Target
Cholinesterase
Ligand
BDBM50271471
Substrate
Meas. Tech.
ChEMBL_552458 (CHEMBL1002718)
Ki
3.22±n/a nM
Citation
 Butini, SCampiani, GBorriello, MGemma, SPanico, APersico, MCatalanotti, BRos, SBrindisi, MAgnusdei, MFiorini, INacci, VNovellino, EBelinskaya, TSaxena, AFattorusso, C Exploiting protein fluctuations at the active-site gorge of human cholinesterases: further optimization of the design strategy to develop extremely potent inhibitors. J Med Chem 51:3154-70 (2008)  
Target
Name:
Cholinesterase
Synonyms:
Acylcholine acylhydrolase Butyrylcholine esterase (BChE) Butyrylcholinesterase (BuChE) CHLE_HUMAN Cholinesterases Pseudocholinesterase
Type:
Homotetramer
Mol. Mass.:
68422.27
Organism:
Homo sapiens (Human)
Description:
P06276
Residue:
602
  
Inhibitor
Name:
BDBM50271471
Synonyms:
1,4-bis[3-(1,2,3,4-Tetrahydroacridin-9-yl)aminopropyl]piperazine | CHEMBL445454
Type:
Small organic molecule
Emp. Form.:
C36H46N6
Mol. Mass.:
562.7906
SMILES:
C(CNc1c2CCCCc2nc2ccccc12)CN1CCN(CCCNc2c3CCCCc3nc3ccccc23)CC1
: