Target
Solute carrier family 22 member 6
Ligand
BDBM50143424
Substrate
Meas. Tech.
ChEMBL_508179 (CHEMBL1008237)
Ki
2951±n/a nM
Citation
 Kaler, GTruong, DMKhandelwal, ANagle, MEraly, SASwaan, PWNigam, SK Structural variation governs substrate specificity for organic anion transporter (OAT) homologs. Potential remote sensing by OAT family members. J Biol Chem 282:23841-53 (2007)  
Target
Name:
Solute carrier family 22 member 6
Synonyms:
Nkt S22A6_MOUSE | Slc22a6
Type:
PROTEIN
Mol. Mass.:
60032.49
Organism:
Mus musculus
Description:
ChEMBL_508179
Residue:
545
  
Inhibitor
Name:
BDBM50143424
Synonyms:
2-(3-hydroxy-6-oxo-6H-xanthen-9-yl)benzoic acid 2-(6-oxido-3-oxo-3H-xanthen-9-yl)benzoate CHEMBL177756 Fluorescite cid_3383
Type:
Small organic molecule
Emp. Form.:
C20H12O5
Mol. Mass.:
332.3063
SMILES:
OC(=O)c1ccccc1-c1c2ccc(O)cc2oc2cc(=O)ccc12
: