Target
Solute carrier family 22 member 6
Ligand
BDBM50240408
Substrate
Meas. Tech.
ChEMBL_508179 (CHEMBL1008237)
Ki
16700±n/a nM
Citation
 Kaler, GTruong, DMKhandelwal, ANagle, MEraly, SASwaan, PWNigam, SK Structural variation governs substrate specificity for organic anion transporter (OAT) homologs. Potential remote sensing by OAT family members. J Biol Chem 282:23841-53 (2007)  
Target
Name:
Solute carrier family 22 member 6
Synonyms:
Nkt S22A6_MOUSE | Slc22a6
Type:
PROTEIN
Mol. Mass.:
60032.49
Organism:
Mus musculus
Description:
ChEMBL_508179
Residue:
545
  
Inhibitor
Name:
BDBM50240408
Synonyms:
1-hexanecarboxylate enanthate heptanoate heptoate n-heptanoate n-heptylate oenanthylate
Type:
Small organic molecule
Emp. Form.:
C7H13O2
Mol. Mass.:
129.1775
SMILES:
CCCCCCC([O-])=O
: