Target
Solute carrier family 22 member 6
Ligand
BDBM50366524
Substrate
Meas. Tech.
ChEMBL_508179 (CHEMBL1008237)
Ki
203000±n/a nM
Citation
 Kaler, GTruong, DMKhandelwal, ANagle, MEraly, SASwaan, PWNigam, SK Structural variation governs substrate specificity for organic anion transporter (OAT) homologs. Potential remote sensing by OAT family members. J Biol Chem 282:23841-53 (2007)  
Target
Name:
Solute carrier family 22 member 6
Synonyms:
Nkt S22A6_MOUSE | Slc22a6
Type:
PROTEIN
Mol. Mass.:
60032.49
Organism:
Mus musculus
Description:
ChEMBL_508179
Residue:
545
  
Inhibitor
Name:
BDBM50366524
Synonyms:
ESTRONE Estrone 3-sulfate | Estrone Sulphate
Type:
Small organic molecule
Emp. Form.:
C18H22O5S
Mol. Mass.:
350.429
SMILES:
C[C@]12CC[C@H]3[C@@H](CCc4cc(OS(O)(=O)=O)ccc34)[C@@H]1CCC2=O
: