Target
Solute carrier family 22 member 20
Ligand
BDBM50206441
Substrate
Meas. Tech.
ChEMBL_508178 (CHEMBL1008236)
Ki
4400±n/a nM
Citation
 Kaler, GTruong, DMKhandelwal, ANagle, MEraly, SASwaan, PWNigam, SK Structural variation governs substrate specificity for organic anion transporter (OAT) homologs. Potential remote sensing by OAT family members. J Biol Chem 282:23841-53 (2007)  
Target
Name:
Solute carrier family 22 member 20
Synonyms:
Gm963 S22AK_MOUSE | Slc22a20
Type:
PROTEIN
Mol. Mass.:
60953.19
Organism:
Mus musculus
Description:
ChEMBL_508178
Residue:
556
  
Inhibitor
Name:
BDBM50206441
Synonyms:
2-(2,4,5,7-tetrabromo-3-hydroxy-6-oxo-6H-xanthen-9-yl)benzoic acid CHEMBL376503
Type:
Small organic molecule
Emp. Form.:
C20H8Br4O5
Mol. Mass.:
647.891
SMILES:
OC(=O)c1ccccc1-c1c2cc(Br)c(O)c(Br)c2oc2c(Br)c(=O)c(Br)cc12
: