Target
Solute carrier family 22 member 20
Ligand
BDBM50270011
Substrate
Meas. Tech.
ChEMBL_508178 (CHEMBL1008236)
Ki
7210000±n/a nM
Citation
 Kaler, GTruong, DMKhandelwal, ANagle, MEraly, SASwaan, PWNigam, SK Structural variation governs substrate specificity for organic anion transporter (OAT) homologs. Potential remote sensing by OAT family members. J Biol Chem 282:23841-53 (2007)  
Target
Name:
Solute carrier family 22 member 20
Synonyms:
Gm963 S22AK_MOUSE | Slc22a20
Type:
PROTEIN
Mol. Mass.:
60953.19
Organism:
Mus musculus
Description:
ChEMBL_508178
Residue:
556
  
Inhibitor
Name:
BDBM50270011
Synonyms:
estradiol disulfate
Type:
Small organic molecule
Emp. Form.:
C18H22O8S2
Mol. Mass.:
430.494
SMILES:
C[C@]12CC[C@H]3[C@@H](CCc4cc(OS([O-])(=O)=O)ccc34)[C@@H]1CC[C@@H]2OS([O-])(=O)=O
: