Target
Adenosine receptor A1
Ligand
BDBM7459
Substrate
Meas. Tech.
ChEMBL_527329 (CHEMBL972849)
Ki
1550±n/a nM
Citation
 Ingkaninan, KIJzerman, APVerpoorte, R Luteolin, a compound with adenosine A(1) receptor-binding activity, and chromone and dihydronaphthalenone constituents from Senna siamea. J Nat Prod 63:315-7 (2000)  
Target
Name:
Adenosine receptor A1
Synonyms:
AA1R_RAT ADENOSINE A1 high Adenosine A1 receptor (A1) Adenosine receptors A1 | Adora1
Type:
Protein
Mol. Mass.:
36704.13
Organism:
Rattus norvegicus (rat)
Description:
Residue:
326
  
Inhibitor
Name:
BDBM7459
Synonyms:
2-(3,4-dihydroxyphenyl)-5,7-dihydroxy-4H-chromen-4-one CHEMBL151 Luteolin (4) cid_5280445 med.21724, Compound 3
Type:
Small organic molecule
Emp. Form.:
C15H10O6
Mol. Mass.:
286.2363
SMILES:
Oc1cc(O)c2c(c1)oc(cc2=O)-c1ccc(O)c(O)c1
: