Target
Sucrase-isomaltase, intestinal
Ligand
BDBM50242271
Substrate
Meas. Tech.
ChEMBL_490824 (CHEMBL993563)
IC50
1200±n/a nM
Citation
 Kuriyama, CKamiyama, OIkeda, KSanae, FKato, AAdachi, IImahori, TTakahata, HOkamoto, TAsano, N In vitro inhibition of glycogen-degrading enzymes and glycosidases by six-membered sugar mimics and their evaluation in cell cultures. Bioorg Med Chem 16:7330-6 (2008)  
Target
Name:
Sucrase-isomaltase, intestinal
Synonyms:
SUIS_RAT Sucrase-isomaltase | alpha-Glucosidase (α-Glucosidase)
Type:
Enzyme
Mol. Mass.:
210329.04
Organism:
Rattus norvegicus (Rat)
Description:
P23739
Residue:
1841
  
Inhibitor
Name:
BDBM50242271
Synonyms:
(2R,3R,4R,5S)-1-(2-hydroxyethyl)-2-(hydroxymethyl)piperidine-3,4,5-triol BAY-M-1099 Glyset N-Hydroxyethyl-1-deoxynojirimycin | cid_441314
Type:
Small organic molecule
Emp. Form.:
C8H17NO5
Mol. Mass.:
207.2243
SMILES:
OCCN1C[C@H](O)[C@@H](O)[C@H](O)[C@H]1CO
: