Target
Lysosomal alpha-glucosidase
Ligand
BDBM50263044
Substrate
Meas. Tech.
ChEMBL_490840 (CHEMBL993579)
IC50
70±n/a nM
Citation
 Kuriyama, CKamiyama, OIkeda, KSanae, FKato, AAdachi, IImahori, TTakahata, HOkamoto, TAsano, N In vitro inhibition of glycogen-degrading enzymes and glycosidases by six-membered sugar mimics and their evaluation in cell cultures. Bioorg Med Chem 16:7330-6 (2008)  
Target
Name:
Lysosomal alpha-glucosidase
Synonyms:
70 kDa lysosomal alpha-glucosidase Acid maltase Alpha glucosidase LYAG_HUMAN
Type:
PROTEIN
Mol. Mass.:
105312.45
Organism:
Homo sapiens (Human)
Description:
ChEMBL_1506060
Residue:
952
  
Inhibitor
Name:
BDBM50263044
Synonyms:
CHEMBL476960 | Voglibose
Type:
Small organic molecule
Emp. Form.:
C10H21NO7
Mol. Mass.:
267.2762
SMILES:
OCC(CO)N[C@H]1C[C@](O)(CO)[C@@H](O)[C@H](O)[C@H]1O
: