Target
Adenosine receptor A2a
Ligand
BDBM50086152
Substrate
Meas. Tech.
ChEMBL_513609 (CHEMBL967913)
Ki
6.5±n/a nM
Citation
 Mantri, Mde Graaf, Ovan Veldhoven, JGöblyös, Avon Frijtag Drabbe Künzel, JKMulder-Krieger, TLink, Rde Vries, HBeukers, MWBrussee, JIjzerman, AP 2-Amino-6-furan-2-yl-4-substituted nicotinonitriles as A2A adenosine receptor antagonists. J Med Chem 51:4449-55 (2008)  
Target
Name:
Adenosine receptor A2a
Synonyms:
A2A adenosine receptor (hA2A) ADENOSINE A2 ADORA2 Adenosine A2A receptor (A2AAR)
Type:
G Protein-Coupled Receptor (GPCR)
Mol. Mass.:
44716.46
Organism:
Homo sapiens (Human)
Description:
P29274
Residue:
412
  
Inhibitor
Name:
BDBM50086152
Synonyms:
4-Amino-6-benzylamino-2-phenyl-2H-[1,2,4]triazolo[4,3-a]quinoxalin-1-one CHEMBL274274
Type:
Small organic molecule
Emp. Form.:
C22H18N6O
Mol. Mass.:
382.4179
SMILES:
Nc1nc2c(NCc3ccccc3)cccc2n2c1nn(-c1ccccc1)c2=O
: