Target
Galectin-1
Ligand
BDBM50272418
Substrate
Meas. Tech.
ChEMBL_510247 (CHEMBL1005625)
IC50
300000±n/a nM
Citation
 Giguère, DBonin, MACloutier, PPatnam, RSt-Pierre, CSato, SRoy, R Synthesis of stable and selective inhibitors of human galectins-1 and -3. Bioorg Med Chem 16:7811-23 (2008)  
Target
Name:
Galectin-1
Synonyms:
14 kDa lectin HPL LGALS1 Lectin galactoside-binding soluble 1 | Putative MAPK-activating protein PM12
Type:
beta galactoside-binding protein
Mol. Mass.:
14713.53
Organism:
Homo sapiens (Human)
Description:
P09382
Residue:
135
  
Inhibitor
Name:
BDBM50272418
Synonyms:
(2S,3R,4S,5R,6R)-2-((2R,3S,4R,5R,6S)-6-((1-((2S,3S,4S,5R,6S)-3,4-dihydroxy-6-(hydroxymethyl)-5-((2R,3S,4R,5S,6S)-3,4,5-trihydroxy-6-(hydroxymethyl)-tetrahydro-2H-pyran-2-yloxy)-tetrahydro-2H-pyran-2-yl)-1H-1,2,3-triazol-4-yl)methylthio)-4,5-dihydroxy-2-(hydroxymethyl)-tetrahydro-2H-pyran-3-yloxy)-6-(hydroxymethyl)-tetrahydro-2H-pyran-3,4,5-triol | CHEMBL508204
Type:
Small organic molecule
Emp. Form.:
C27H45N3O20S
Mol. Mass.:
763.719
SMILES:
OC[C@H]1O[C@@H](O[C@@H]2[C@@H](CO)O[C@@H](SCc3cn(nn3)[C@H]3O[C@@H](CO)[C@H](O[C@H]4O[C@@H](CO)[C@@H](O)[C@@H](O)[C@@H]4O)[C@@H](O)[C@@H]3O)[C@H](O)[C@H]2O)[C@H](O)[C@@H](O)[C@H]1O
: