Target
cGMP-specific 3',5'-cyclic phosphodiesterase
Ligand
BDBM19460
Substrate
Meas. Tech.
ChEMBL_510814 (CHEMBL998833)
IC50
16230±n/a nM
Citation
 Dell'Agli, MGalli, GVDal Cero, EBelluti, FMatera, RZironi, EPagliuca, GBosisio, E Potent inhibition of human phosphodiesterase-5 by icariin derivatives. J Nat Prod 71:1513-7 (2008)  
Target
Name:
cGMP-specific 3',5'-cyclic phosphodiesterase
Synonyms:
3',5'-cyclic phosphodiesterase PDE5 PDE5A_HUMAN Phosphodiesterase 5 (PDE5) Phosphodiesterase 5A (PDE5A) cGMP-specific 3',5'-cyclic phosphodiesterase
Type:
Protein
Mol. Mass.:
99975.83
Organism:
Homo sapiens (Human)
Description:
O76074
Residue:
875
  
Inhibitor
Name:
BDBM19460
Synonyms:
(2S)-5,7-dihydroxy-2-(4-hydroxyphenyl)-8-(3-methylbut-2-en-1-yl)-3,4-dihydro-2H-1-benzopyran-4-one AIDS095901 YS04 | cid_509245
Type:
Phytoestrogen
Emp. Form.:
C20H20O5
Mol. Mass.:
340.3698
SMILES:
[#6]\[#6](-[#6])=[#6]\[#6]-c1c(-[#8])cc(-[#8])c2-[#6](=O)-[#6]-[#6@H](-[#8]-c12)-c1ccc(-[#8])cc1
: