Target
Sodium-dependent dopamine transporter
Ligand
BDBM35226
Substrate
Meas. Tech.
ChEMBL_491870 (CHEMBL946207)
IC50
>10000±n/a nM
Citation
 Zhang, MJovic, FVickers, TDyck, BTamiya, JGrey, JTran, JAFleck, BAPick, RFoster, ACChen, C Studies on the structure-activity relationship of bicifadine analogs as monoamine transporter inhibitors. Bioorg Med Chem Lett 18:3682-6 (2008)  
Target
Name:
Sodium-dependent dopamine transporter
Synonyms:
DA transporter SC6A3_RAT Sodium-dependent dopamine transporter | Sodium-dependent dopamine transporter (DAT)
Type:
Multi-pass membrane protein
Mol. Mass.:
68749.45
Organism:
Rattus norvegicus (rat)
Description:
P23977
Residue:
619
  
Inhibitor
Name:
BDBM35226
Synonyms:
(S,S)-reboxetine Vestra
Type:
Small organic molecule
Emp. Form.:
C19H23NO3
Mol. Mass.:
313.3908
SMILES:
CCOc1ccccc1O[C@H]([C@@H]1CNCCO1)c1ccccc1
: