Target
Progesterone receptor
Ligand
BDBM50264311
Substrate
Meas. Tech.
ChEMBL_535114 (CHEMBL983677)
EC50
0.4±n/a nM
Citation
 Kern, JCTerefenko, EAFensome, AUnwalla, RWrobel, JCohen, JZhu, YBerrodin, TJYudt, MRWinneker, RCZhang, ZZhang, P 1,5-Dihydro-benzo[e][1,4]oxazepin-2(1H)-ones containing a 7-(5'-cyanopyrrol-2-yl) group as nonsteroidal progesterone receptor modulators. Bioorg Med Chem Lett 18:5015-7 (2008)  
Target
Name:
Progesterone receptor
Synonyms:
NR3C3 PGR PRGR_HUMAN | progesterone
Type:
Protein
Mol. Mass.:
98979.52
Organism:
Homo sapiens (Human)
Description:
P06401
Residue:
933
  
Inhibitor
Name:
BDBM50264311
Synonyms:
5-(5-(furan-2-yl)-5-methyl-2-oxo-1,2,3,5-tetrahydrobenzo[e][1,4]oxazepin-7-yl)-1-methyl-1H-pyrrole-2-carbonitrile | CHEMBL489788
Type:
Small organic molecule
Emp. Form.:
C20H17N3O3
Mol. Mass.:
347.3673
SMILES:
Cn1c(ccc1-c1ccc2NC(=O)COC(C)(c3ccco3)c2c1)C#N
: