Target
Prostaglandin G/H synthase 1
Ligand
BDBM50273683
Substrate
Meas. Tech.
ChEMBL_560977 (CHEMBL1014424)
IC50
>10±n/a nM
Citation
 Koeberle, AZettl, HGreiner, CWurglics, MSchubert-Zsilavecz, MWerz, O Pirinixic acid derivatives as novel dual inhibitors of microsomal prostaglandin E2 synthase-1 and 5-lipoxygenase. J Med Chem 51:8068-76 (2008)  
Target
Name:
Prostaglandin G/H synthase 1
Synonyms:
COX1 Cyclooxygenase-1 (COX-1) PTGS1 | Prostaglandin G/H synthase (cyclooxygenase)
Type:
Protein
Mol. Mass.:
68868.60
Organism:
Ovis aries (Sheep)
Description:
Residue:
600
  
Inhibitor
Name:
BDBM50273683
Synonyms:
2-(4,6-Diphenethoxypyrimidin-2-ylthio)hexanoic acid | CHEMBL461883
Type:
Small organic molecule
Emp. Form.:
C26H30N2O4S
Mol. Mass.:
466.592
SMILES:
CCCCC(Sc1nc(OCCc2ccccc2)cc(OCCc2ccccc2)n1)C(O)=O
: