Target
Dihydrofolate reductase
Ligand
BDBM50253580
Substrate
Meas. Tech.
ChEMBL_538596 (CHEMBL1026634)
IC50
7.2±n/a nM
Citation
 Gangjee, AAdair, OOPagley, MQueener, SF N9-substituted 2,4-diaminoquinazolines: synthesis and biological evaluation of lipophilic inhibitors of pneumocystis carinii and toxoplasma gondii dihydrofolate reductase. J Med Chem 51:6195-200 (2008)  
Target
Name:
Dihydrofolate reductase
Synonyms:
DYR_PNECA Dihydrofolate reductase Tetrahydrofolate dehydrogenase
Type:
Enzyme
Mol. Mass.:
23891.29
Organism:
Pneumocystis carinii
Description:
Residue:
206
  
Inhibitor
Name:
BDBM50253580
Synonyms:
2,4-Diamino-6-[N-(beta-naphthyl)-N-ethylamino]quinazoline | CHEMBL522678
Type:
Small organic molecule
Emp. Form.:
C21H21N5
Mol. Mass.:
343.4249
SMILES:
CCN(Cc1ccc2ccccc2c1)c1ccc2nc(N)nc(N)c2c1
: