Target
Solute carrier family 22 member 1
Ligand
BDBM50240370
Substrate
Meas. Tech.
ChEMBL_534654 (CHEMBL994103)
IC50
28600±n/a nM
Citation
 Ahlin, GKarlsson, JPedersen, JMGustavsson, LLarsson, RMatsson, PNorinder, UBergström, CAArtursson, P Structural requirements for drug inhibition of the liver specific human organic cation transport protein 1. J Med Chem 51:5932-42 (2008)  
Target
Name:
Solute carrier family 22 member 1
Synonyms:
Adrenergic Alpha Organic cation transporter 1 SLC22A1 hOCT1
Type:
Enzyme Catalytic Domain
Mol. Mass.:
61154.85
Organism:
Homo sapiens (Human)
Description:
Adrenergic Alpha 0 HUMAN::O15245
Residue:
554
  
Inhibitor
Name:
BDBM50240370
Synonyms:
1-(2-(allyloxy)phenoxy)-3-(isopropylamino)propan-2-ol 1-(2-Allyloxy-phenoxy)-3-isopropylamino-propan-2-ol (Oxprenolol) CHEMBL546 Trasicor
Type:
Small organic molecule
Emp. Form.:
C15H23NO3
Mol. Mass.:
265.348
SMILES:
CC(C)NCC(O)COc1ccccc1OCC=C
: