Target
Kappa-type opioid receptor
Ligand
BDBM50247803
Substrate
Meas. Tech.
ChEMBL_495340 (CHEMBL1006332)
Ki
0.940000±n/a nM
Citation
 Li, GAschenbach, LCChen, JCassidy, MPStevens, DLGabra, BHSelley, DEDewey, WLWestkaemper, RBZhang, Y Design, synthesis, and biological evaluation of 6alpha- and 6beta-N-heterocyclic substituted naltrexamine derivatives as mu opioid receptor selective antagonists. J Med Chem 52:1416-27 (2010)  
Target
Name:
Kappa-type opioid receptor
Synonyms:
K-OR-1 Kappa-opioid receptor (KOR) Kappa-type opioid receptor (KOR) OPIATE Kappa OPRK1 kappa opioid receptor (KOR)
Type:
G Protein-Coupled Receptor (GPCR)
Mol. Mass.:
42648.76
Organism:
Homo sapiens (Human)
Description:
P41145
Residue:
380
  
Inhibitor
Name:
BDBM50247803
Synonyms:
Beta-Funeltrexamine beta-funaltrexamine methyl 3-[4-cyclopropylmethyl-10,17-dihydroxy-12-oxa-4-azapentacyclo[9.6.1.01,13.05,17.07,18]octadeca-7(18),8,10-trien-14-ylcarbamoyl]-(E)-2-propenoate
Type:
Small organic molecule
Emp. Form.:
C25H30N2O6
Mol. Mass.:
454.5155
SMILES:
COC(=O)\C=C\C(=O)N[C@@H]1CC[C@@]2(O)[C@H]3Cc4ccc(O)c5O[C@@H]1[C@]2(CCN3CC1CC1)c45
: