Target
Carbonic anhydrase
Ligand
BDBM10866
Substrate
Meas. Tech.
ChEMBL_515851 (CHEMBL993110)
Ki
223±n/a nM
Citation
 Isik, SKockar, FAydin, MArslan, OGuler, OOInnocenti, AScozzafava, ASupuran, CT Carbonic anhydrase inhibitors: inhibition of the beta-class enzyme from the yeast Saccharomyces cerevisiae with sulfonamides and sulfamates. Bioorg Med Chem 17:1158-63 (2009)  
Target
Name:
Carbonic anhydrase
Synonyms:
CAN_YEAST NCE3
Type:
PROTEIN
Mol. Mass.:
24861.97
Organism:
Saccharomyces cerevisiae
Description:
ChEMBL_1507033
Residue:
221
  
Inhibitor
Name:
BDBM10866
Synonyms:
4-amino-6-(trifluoromethyl)benzene-1,3-disulfonamide aromatic/heteroaromatic sulfonamide 11
Type:
Small organic molecule
Emp. Form.:
C7H8F3N3O4S2
Mol. Mass.:
319.281
SMILES:
Nc1cc(c(cc1S(N)(=O)=O)S(N)(=O)=O)C(F)(F)F
: