Target
Carbonic anhydrase
Ligand
BDBM10890
Substrate
Meas. Tech.
ChEMBL_515851 (CHEMBL993110)
Ki
133±n/a nM
Citation
 Isik, SKockar, FAydin, MArslan, OGuler, OOInnocenti, AScozzafava, ASupuran, CT Carbonic anhydrase inhibitors: inhibition of the beta-class enzyme from the yeast Saccharomyces cerevisiae with sulfonamides and sulfamates. Bioorg Med Chem 17:1158-63 (2009)  
Target
Name:
Carbonic anhydrase
Synonyms:
CAN_YEAST NCE3
Type:
PROTEIN
Mol. Mass.:
24861.97
Organism:
Saccharomyces cerevisiae
Description:
ChEMBL_1507033
Residue:
221
  
Inhibitor
Name:
BDBM10890
Synonyms:
1-N-(3-chloro-1H-indol-7-yl)benzene-1,4-disulfonamide Compound 6 Indisulam (IND) | Sulfonamide, 7
Type:
Small organic molecule
Emp. Form.:
C14H12ClN3O4S2
Mol. Mass.:
385.846
SMILES:
NS(=O)(=O)c1ccc(cc1)S(=O)(=O)Nc1cccc2c(Cl)c[nH]c12
: