Target
Carbonic anhydrase 1
Ligand
BDBM11639
Substrate
Meas. Tech.
ChEMBL_515849 (CHEMBL993108)
Ki
50000±n/a nM
Citation
 Isik, SKockar, FAydin, MArslan, OGuler, OOInnocenti, AScozzafava, ASupuran, CT Carbonic anhydrase inhibitors: inhibition of the beta-class enzyme from the yeast Saccharomyces cerevisiae with sulfonamides and sulfamates. Bioorg Med Chem 17:1158-63 (2009)  
Target
Name:
Carbonic anhydrase 1
Synonyms:
CA-I CAB Carbonate dehydratase I Carbonic anhydrase 1 (CA I) Carbonic anhydrase 1 (Recombinant CA I) Carbonic anhydrase B Carbonic anhydrase I (CA I) Carbonic anhydrase I (CAI) Carbonic anhydrase isoenzyme I (hCA I) | hCA
Type:
Enzyme
Mol. Mass.:
28873.37
Organism:
Homo sapiens (Human)
Description:
P00915
Residue:
261
  
Inhibitor
Name:
BDBM11639
Synonyms:
4-[5-(4-methylphenyl)-3-(trifluoromethyl)-1H-pyrazol-1-yl]benzene-1-sulfonamide CLX Celecoxib US11478464, Compound Celecoxib US8741944, Comparative Compound cid_2662
Type:
Small organic molecule
Emp. Form.:
C17H14F3N3O2S
Mol. Mass.:
381.372
SMILES:
Cc1ccc(cc1)-c1cc(nn1-c1ccc(cc1)S(N)(=O)=O)C(F)(F)F
: