Target
Carbonic anhydrase
Ligand
BDBM29277
Substrate
Meas. Tech.
ChEMBL_515851 (CHEMBL993110)
Ki
165±n/a nM
Citation
 Isik, SKockar, FAydin, MArslan, OGuler, OOInnocenti, AScozzafava, ASupuran, CT Carbonic anhydrase inhibitors: inhibition of the beta-class enzyme from the yeast Saccharomyces cerevisiae with sulfonamides and sulfamates. Bioorg Med Chem 17:1158-63 (2009)  
Target
Name:
Carbonic anhydrase
Synonyms:
CAN_YEAST NCE3
Type:
PROTEIN
Mol. Mass.:
24861.97
Organism:
Saccharomyces cerevisiae
Description:
ChEMBL_1507033
Residue:
221
  
Inhibitor
Name:
BDBM29277
Synonyms:
CHEMBL451332 | sulfonamide, 3
Type:
Small organic molecule
Emp. Form.:
C9H11NO4S
Mol. Mass.:
229.253
SMILES:
NS(=O)(=O)c1ccc(CCC(O)=O)cc1
: