Target
Nociceptin receptor
Ligand
BDBM50255137
Substrate
Meas. Tech.
ChEMBL_515862 (CHEMBL993121)
Ki
2.5±n/a nM
Citation
 Hayashi, SHirao, AImai, ANakamura, HMurata, YOhashi, KNakata, E Novel non-peptide nociceptin/orphanin FQ receptor agonist, 1-[1-(1-Methylcyclooctyl)-4-piperidinyl]-2-[(3R)-3-piperidinyl]-1H-benzimidazole: design, synthesis, and structure-activity relationship of oral receptor occupancy in the brain for orally potent antianxiety drug. J Med Chem 52:610-25 (2009)  
Target
Name:
Nociceptin receptor
Synonyms:
KOR-3 Mu-type opioid receptor (Mu) Nociceptin Receptor (ORL1 Receptor) Nociceptin receptor (ORL-1) Nociceptin/Orphanin FQ, NOP receptor OPIATE ORL-1 OPRL1 protein ORL1 Opioid receptor like-1 Orphanin FQ receptor (ORL1) | P41146
Type:
G Protein-Coupled Receptor (GPCR)
Mol. Mass.:
40702.87
Organism:
Homo sapiens (Human)
Description:
P41146
Residue:
370
  
Inhibitor
Name:
BDBM50255137
Synonyms:
1-[1-(1-methylcyclooctyl)piperidin-4-yl]-1H-benzimidazole | CHEMBL480619
Type:
Small organic molecule
Emp. Form.:
C21H31N3
Mol. Mass.:
325.4909
SMILES:
CC1(CCCCCCC1)N1CCC(CC1)n1cnc2ccccc12
: