Target
Mu-type opioid receptor
Ligand
BDBM50278263
Substrate
Meas. Tech.
ChEMBL_564842 (CHEMBL955069)
Ki
0.072000±n/a nM
Citation
 Wentland, MPLou, RLu, QBu, YDenhardt, CJin, JGanorkar, RVanAlstine, MAGuo, CCohen, DJBidlack, JM Syntheses of novel high affinity ligands for opioid receptors. Bioorg Med Chem Lett 19:2289-94 (2009)  
Target
Name:
Mu-type opioid receptor
Synonyms:
M-OR-1 MOR-1 MUOR1 Mu opiate receptor OPRM1 hMOP | mu-type opioid receptor isoform MOR-1
Type:
G Protein-Coupled Receptor (GPCR)
Mol. Mass.:
44789.51
Organism:
Homo sapiens (Human)
Description:
P35372
Residue:
400
  
Inhibitor
Name:
BDBM50278263
Synonyms:
(1R,9R,10S,13R)-17-(cyclobutylmethyl)-3,10,13-trihydroxy-17-azatetracyclo[7.5.3.0^{1,10}.0^{2,7}]heptadeca-2(7),3,5-triene-4-carboxamide US10231963, Table B.20 US10736890, Compound TABLE B.20 US11534436, Compound Table B.20 US9656961, Example 00137
Type:
Small organic molecule
Emp. Form.:
C22H30N2O4
Mol. Mass.:
386.4846
SMILES:
NC(=O)c1ccc2C[C@H]3N(CC4CCC4)CC[C@@]4(C[C@H](O)CC[C@@]34O)c2c1O
: