Target
Mu-type opioid receptor
Ligand
BDBM50278386
Substrate
Meas. Tech.
ChEMBL_564842 (CHEMBL955069)
Ki
0.300000±n/a nM
Citation
 Wentland, MPLou, RLu, QBu, YDenhardt, CJin, JGanorkar, RVanAlstine, MAGuo, CCohen, DJBidlack, JM Syntheses of novel high affinity ligands for opioid receptors. Bioorg Med Chem Lett 19:2289-94 (2009)  
Target
Name:
Mu-type opioid receptor
Synonyms:
M-OR-1 MOR-1 MUOR1 Mu opiate receptor OPRM1 hMOP | mu-type opioid receptor isoform MOR-1
Type:
G Protein-Coupled Receptor (GPCR)
Mol. Mass.:
44789.51
Organism:
Homo sapiens (Human)
Description:
P35372
Residue:
400
  
Inhibitor
Name:
BDBM50278386
Synonyms:
(1S,9R,10R)-3-hydroxy-17-methyl-13-oxo-17-azatetracyclo[7.5.3.0^{1,10}.0^{2,7}]heptadeca-2(7),3,5-triene-4-carboxamide | CHEMBL471048
Type:
Small organic molecule
Emp. Form.:
C18H22N2O3
Mol. Mass.:
314.3789
SMILES:
CN1CC[C@]23CC(=O)CC[C@H]2[C@H]1Cc1ccc(C(N)=O)c(O)c31
: