Target
Kappa-type opioid receptor
Ligand
BDBM50278337
Substrate
Meas. Tech.
ChEMBL_565189 (CHEMBL958395)
EC50
9±n/a nM
Citation
 Wentland, MPLou, RLu, QBu, YDenhardt, CJin, JGanorkar, RVanAlstine, MAGuo, CCohen, DJBidlack, JM Syntheses of novel high affinity ligands for opioid receptors. Bioorg Med Chem Lett 19:2289-94 (2009)  
Target
Name:
Kappa-type opioid receptor
Synonyms:
K-OR-1 Kappa-opioid receptor (KOR) Kappa-type opioid receptor (KOR) OPIATE Kappa OPRK1 kappa opioid receptor (KOR)
Type:
G Protein-Coupled Receptor (GPCR)
Mol. Mass.:
42648.76
Organism:
Homo sapiens (Human)
Description:
P41145
Residue:
380
  
Inhibitor
Name:
BDBM50278337
Synonyms:
CHEMBL470617 | Naltrexone methiodide
Type:
Small organic molecule
Emp. Form.:
C21H26NO4
Mol. Mass.:
356.4349
SMILES:
C[N+]1(CC2CC2)CC[C@@]23[C@H]4Oc5c2c(C[C@@H]1[C@]3(O)CCC4=O)ccc5O
: